nixbot

builds

pschmitt/nixos-config build #175 failed

branch main · PR #998 · commit 91b06a2bb7 · · took 1h 33m · eval 31m 26s

3 failed
failed attributes
status attribute duration
failed herculesCI.onPush.default.outputs.hosts.ge2 33m 4s
noctalia-5.4.0: patching file src/ui/ui_tree_reconciler.cpp Hunk #1 succeeded at 519 (offset 37 lines). Hunk #2 succeeded at 1804 (offset 359 lines). applying p …
noctalia-5.4.0:
patching file src/ui/ui_tree_reconciler.cpp
Hunk #1 succeeded at 519 (offset 37 lines).
Hunk #2 succeeded at 1804 (offset 359 lines).
applying patch /nix/store/a3gf3wqv7639yn12hzrpjgnvbxakx7zw-0005-hyprland-main-keyboard-layout.patch
patching file src/compositors/hyprland/hyprland_keyboard_backend.cpp
patching file src/compositors/hyprland/hyprland_keyboard_backend.h
Hunk #2 FAILED at 29.
1 out of 2 hunks FAILED -- saving rejects to file src/compositors/hyprland/hyprland_keyboard_backend.h.rej

lumine-capture-0.3.0:
---- ocr::daemon::tests::socket_left_by_a_dead_daemon_is_replaced stdout ----
thread 'ocr::daemon::tests::socket_left_by_a_dead_daemon_is_replaced' (10183) panicked at src/ocr/daemon/tests.rs:302:5:
assertion failed: UnixStream::connect(&paths.socket).is_err()
note: run with `RUST_BACKTRACE=1` environment variable to display a backtrace
failures:
    ocr::daemon::tests::socket_left_by_a_dead_daemon_is_replaced
test result: FAILED. 123 passed; 1 failed; 5 ignored; 0 measured; 0 filtered out; finished in 2.59s
error: test failed, to rerun pass `--bin lumine-capture`
failed herculesCI.onPush.default.outputs.hosts.gk4 31m 10s
noctalia-5.4.0: patching file src/ui/ui_tree_reconciler.cpp Hunk #1 succeeded at 519 (offset 37 lines). Hunk #2 succeeded at 1804 (offset 359 lines). applying p …
noctalia-5.4.0:
patching file src/ui/ui_tree_reconciler.cpp
Hunk #1 succeeded at 519 (offset 37 lines).
Hunk #2 succeeded at 1804 (offset 359 lines).
applying patch /nix/store/a3gf3wqv7639yn12hzrpjgnvbxakx7zw-0005-hyprland-main-keyboard-layout.patch
patching file src/compositors/hyprland/hyprland_keyboard_backend.cpp
patching file src/compositors/hyprland/hyprland_keyboard_backend.h
Hunk #2 FAILED at 29.
1 out of 2 hunks FAILED -- saving rejects to file src/compositors/hyprland/hyprland_keyboard_backend.h.rej

squeekboard-1.43.1:
unpacking source archive /nix/store/9wqwrxsz42118ay5s8cimspnkla4scsj-source
source root is source
Executing cargoSetupPostUnpackHook
Finished cargoSetupPostUnpackHook
applying patch /nix/store/r5a8ppzc0yqinybwgqh0gkjbw6kz6cvi-82c754a92807ffa851defd59dea99bee652a2b2b.patch
patching file src/vkeyboard.rs
substituteStream() in derivation squeekboard-1.43.1: ERROR: pattern fn\ close\(fd:\ u32\)\; doesn't match anything in file 'src/vkeyboard.rs'
failed herculesCI.onPush.default.outputs.hosts.x13 10m 33s
noctalia-5.4.0: patching file src/ui/ui_tree_reconciler.cpp Hunk #1 succeeded at 519 (offset 37 lines). Hunk #2 succeeded at 1804 (offset 359 lines). applying p …
noctalia-5.4.0:
patching file src/ui/ui_tree_reconciler.cpp
Hunk #1 succeeded at 519 (offset 37 lines).
Hunk #2 succeeded at 1804 (offset 359 lines).
applying patch /nix/store/a3gf3wqv7639yn12hzrpjgnvbxakx7zw-0005-hyprland-main-keyboard-layout.patch
patching file src/compositors/hyprland/hyprland_keyboard_backend.cpp
patching file src/compositors/hyprland/hyprland_keyboard_backend.h
Hunk #2 FAILED at 29.
1 out of 2 hunks FAILED -- saving rejects to file src/compositors/hyprland/hyprland_keyboard_backend.h.rej
109 succeeded
succeeded attributes
status attribute duration
loading…