nixbot

builds

pschmitt/nixos-config build #28 building

branch main · commit 42c9c68ac3 · · running for 3h 3m · eval 56m 53s

192 of 198 attributes done
eval warnings 50 kinds · 85 occurrences
  • error yaml/_yaml.h:2:10: fatal error: yaml.h: No such file or directory ×1
  • error src/pytest_codspeed/instruments/hooks/instrument-hooks/dist/core.c:778:30: error: expected identifier or ‘(’ before ‘void’ ×1
  • error src/pytest_codspeed/instruments/hooks/instrument-hooks/dist/core.c:796:30: error: expected identifier or ‘(’ before ‘void’ ×1
  • error src/pytest_codspeed/instruments/hooks/instrument-hooks/dist/core.c:1652:3: error: implicit declaration of function ‘bincode_invalidProtocol__anon_2430__4213’ [-Wimplicit-function-declaration] ×1
  • error src/pytest_codspeed/instruments/hooks/instrument-hooks/dist/core.c:2649:30: error: expected identifier or ‘(’ before ‘void’ ×1
  • error src/pytest_codspeed/instruments/hooks/instrument-hooks/dist/core.c:3408:30: error: expected identifier or ‘(’ before ‘void’ ×1
  • warn no files found matching 'README.rst' ×2
  • warn no previously-included files matching '*.pyc' found anywhere in distribution ×8
  • warn no previously-included files found matching 'multidict/_multidict.html' ×2
  • warn no previously-included files found matching 'multidict/*.so' ×2
  • warn no previously-included files found matching 'multidict/*.pyd' ×4
  • warn no files found matching 'README' ×2
  • warn no previously-included files found matching 'src/charset_normalizer/*.c' ×2
  • warn no previously-included files matching '*' found under directory '.github' ×2
  • warn no previously-included files matching '*' found under directory '__pycache__' ×2
  • warn no files found matching '*.h' under directory 'src' ×2
  • warn no files found matching 'docs/*.txt' ×2
  • warn src/pytest_codspeed/instruments/hooks/instrument-hooks/dist/core.c:778:1: warning: ‘noreturn’ attribute ignored [-Wattributes] ×1
  • warn src/pytest_codspeed/instruments/hooks/instrument-hooks/dist/core.c:796:1: warning: ‘noreturn’ attribute ignored [-Wattributes] ×1
  • warn src/pytest_codspeed/instruments/hooks/instrument-hooks/dist/core.c:2649:1: warning: ‘noreturn’ attribute ignored [-Wattributes] ×1
  • warn src/pytest_codspeed/instruments/hooks/instrument-hooks/dist/core.c:3408:1: warning: ‘noreturn’ attribute ignored [-Wattributes] ×1
  • warn build_ext: building extension "pytest_codspeed.instruments.hooks.dist_instrument_hooks" failed: command '/nix/store/…-gcc-wrapper-16.2.0/bin/gcc' failed with exit code 1 ×1
  • warn no previously-included files found matching '.flake8' ×1
  • warn no previously-included files found matching '.pre-commit-config.yaml' ×1
  • warn no previously-included files found matching 'noxfile.py' ×1
  • warn no files found matching '*.png' under directory 'docs' ×1
  • warn no files found matching '*.js' under directory 'src' ×1
  • warn no previously-included files matching '*.pyc' found under directory '__pycache__' ×2
  • warn no previously-included files matching '*.pyo' found under directory '__pycache__' ×2
  • warn no directories found matching 'propcache' ×2
  • warn no previously-included files matching '*.cache' found anywhere in distribution ×4
  • warn no previously-included files found matching 'src/propcache/*.c' ×2
  • warn no previously-included files found matching 'src/propcache/*.html' ×2
  • warn no previously-included files found matching 'src/propcache/*.so' ×2
  • warn no previously-included files found matching 'src/propcache/*.pyd' ×2
  • warn /build/.attrs.sh: line 2: warning: setlocale: LC_ALL: cannot change locale (en_US.utf-8): No such file or directory ×1
  • warn /nix/store/…-stdenv-linux/setup: line 587: warning: setlocale: LC_ALL: cannot change locale (en_US.utf-8): No such file or directory ×1
  • warn no files found matching '.coveragerc' ×4
  • warn no previously-included files found matching '.readthedocs.yml' ×2
  • warn no previously-included files found matching 'mypy.ini' ×2
  • warn no files found matching '*' under directory 'vendor/libuv' ×1
  • warn no previously-included files matching '*' found under directory 'vendor/libuv/.git' ×1
  • warn no previously-included files matching '*' found under directory 'vendor/libuv/docs' ×1
  • warn no previously-included files matching '*' found under directory 'vendor/libuv/img' ×1
  • warn i18n/el.po:7: warning: header field 'Language' missing in header ×1
  • warn i18n/fr.po:86: warning: header field 'Language' missing in header ×1
  • warn i18n/ro.po:106: warning: header field 'Language' missing in header ×1
  • warn i18n/zh_CN.po:47: warning: header field 'Language' missing in header ×1
  • warn /nix/store/…-python3.14-cython-3.3.0/lib/python3.14/site-packages/Cython/Includes/libcpp/atomic.pxd:12:4: Using 'cppclass' while Cython is not in c++ mode ×1
  • warn no files found matching 'pytest.ini' ×2

2 failed
failed attributes
status attribute duration
failed herculesCI.onPush.default.outputs.hosts.fnuc 22s
manifest.json: structuredAttrs is enabled /nix/store/mkzkh0qy315vm8kpkdympxjlja6wnz15-sops-install-secrets-0.0.1/bin/sops-install-secrets: manifest is not valid …
manifest.json:
structuredAttrs is enabled
/nix/store/mkzkh0qy315vm8kpkdympxjlja6wnz15-sops-install-secrets-0.0.1/bin/sops-install-secrets: manifest is not valid: secret ssh/rofl-16/host_keys/ed25519/pubkey in /nix/store/n8j85mi3v7z82yqg09njdb9w50dnqbl5-source/hosts/rofl-16/luks.sops.yaml is not valid: the key 'ssh' cannot be found
failed herculesCI.onPush.default.outputs.hosts.lrz 13m 43s
manifest.json: structuredAttrs is enabled /nix/store/mkzkh0qy315vm8kpkdympxjlja6wnz15-sops-install-secrets-0.0.1/bin/sops-install-secrets: manifest is not valid …
manifest.json:
structuredAttrs is enabled
/nix/store/mkzkh0qy315vm8kpkdympxjlja6wnz15-sops-install-secrets-0.0.1/bin/sops-install-secrets: manifest is not valid: secret ssh/rofl-16/host_keys/ed25519/pubkey in /nix/store/n8j85mi3v7z82yqg09njdb9w50dnqbl5-source/hosts/rofl-16/luks.sops.yaml is not valid: the key 'ssh' cannot be found
6 building
190 succeeded
succeeded attributes
status attribute duration
loading…