pschmitt/nixos-config build #371 failed ← #370 #372 →
eval warnings
1 kind
· 1 occurrence
- error cannot build on 'ssh-ng://nix-remote-builder@rofl-14.brkn.lol': error: failed to start SSH connection to 'rofl-14.brkn.lol' ×1
3 failed
| status | attribute | duration |
|---|---|---|
herculesCI.onPush.default.outputs.hosts.fnuc
|
9m 33s | |
setup: error: Cannot build '/nix/store/6nc17wmasp9q6fvlj9yrpcq87xr13bpz-home-manager-files.drv'. Reason: 1 dependency failed. Output paths: …setup: error: Cannot build '/nix/store/6nc17wmasp9q6fvlj9yrpcq87xr13bpz-home-manager-files.drv'. Reason: 1 dependency failed. Output paths: /nix/store/22j4q5l87v636v52r4swimvjjbvs5j8z-home-manager-files error: Cannot build '/nix/store/p51kvzvjpd0hds7aii39lz875g0hg5pl-hm-putter.json.drv'. Reason: 1 dependency failed. Output paths: /nix/store/7vaf4z8y9by9whpmgw0zrkdywf5vdaxs-hm-putter.json error: Cannot build '/nix/store/r1qp7ghmxifjkn51isigrv9fzxgbdj0z-home-manager-generation.drv'. Reason: 3 dependencies failed. Output paths: /nix/store/fwc7mwk1hg6ilif8vg70lj2w1h56vbbz-home-manager-generation error: Cannot build '/nix/store/qi2pyjq1gna1vvrz4sa2jy84v37fpdkb-unit-home-manager-pschmitt.service.drv'. Reason: 1 dependency failed. Output paths: /nix/store/c2rv67xxh9lin80adw3vm35cnbpp3c2d-unit-home-manager-pschmitt.service error: Cannot build '/nix/store/2p1ig7q3yg3mbnyv2aq1rif21zywh3x7-system-units.drv'. Reason: 2 dependencies failed. Output paths: /nix/store/v0rq9sx2aik9x4q9rb1njl8x6c1mh8qr-system-units error: Cannot build '/nix/store/8svml2pvy0j4czmw5qfrsqk83pm46sl7-etc.drv'. Reason: 3 dependencies failed. Output paths: /nix/store/rv6bnbzhsb7yp6lq8r9s0by33gi6vbna-etc error: Cannot build '/nix/store/ybfa3q5334qw7bq4wzii1g60rfkl7qz6-activate.drv'. Reason: 1 dependency failed. Output paths: /nix/store/yab8ksg4qblqdpkrm415dhbw1n255c1q-activate error: Cannot build '/nix/store/rf5a6xvamv4lz4bzvh698rsskfch3pj5-nixos-system-fnuc-26.11.20261027.31ecbac.drv'. Reason: 2 dependencies failed. Output paths: /nix/store/kn83j8x4lcvghbhvjal5y2ykpjp6n4y6-nixos-system-fnuc-26.11.20261027.31ecbac |
||
herculesCI.onPush.default.outputs.hosts.gk4
|
9m 20s | |
setup: error: Cannot build '/nix/store/7jw799fxsybv7ggjfk1b0f2n4aqdlsc3-unit-polkit.service.drv'. Reason: 1 dependency failed. Output paths: …setup: error: Cannot build '/nix/store/7jw799fxsybv7ggjfk1b0f2n4aqdlsc3-unit-polkit.service.drv'. Reason: 1 dependency failed. Output paths: /nix/store/7c9zjakgw33izbdz9b8wahyv21p05vmn-unit-polkit.service error: Cannot build '/nix/store/68gsh2lfdv8b2mzax4fsr76nv00nlpxj-unit-dbus-broker.service.drv'. Reason: 1 dependency failed. Output paths: /nix/store/k9fcifc293km9nnxv96qy0crfvfg2m2f-unit-dbus-broker.service error: Cannot build '/nix/store/savpak2hv4m1lfxhlwvbx4m2vrf3gb3j-unit-dbus-broker.service.drv'. Reason: 1 dependency failed. Output paths: /nix/store/z004pvv2asvwymq67h090sh536ff6wdg-unit-dbus-broker.service error: Cannot build '/nix/store/nz1mli0cpbkq61pnkxi564f1dba4xh62-system-units.drv'. Reason: 4 dependencies failed. Output paths: /nix/store/j0fpj6hp1q10jdgqvd9xyh0cn54cz2xm-system-units error: Cannot build '/nix/store/p3vr5iw01kixfw8fbl9hwv12p6ymn65d-user-units.drv'. Reason: 1 dependency failed. Output paths: /nix/store/aq94aayf3jspdxg9g9bw9f8f23kqj917-user-units error: Cannot build '/nix/store/nkpyis57a7wf2kdaszick5nqrs4az2hg-etc.drv'. Reason: 9 dependencies failed. Output paths: /nix/store/g3haiw8qwy65zcb7f778ya5kyidd4mpb-etc error: Cannot build '/nix/store/41hgn0x8ai05wxwfcg6njxifjlhffsq7-activate.drv'. Reason: 1 dependency failed. Output paths: /nix/store/y6dl5v9a91ham95574nlvdp5f3fb6r5b-activate error: Cannot build '/nix/store/jx7ybq0fnm59iv3a92krazq8f0mlfici-nixos-system-gk4-26.11.20261027.31ecbac.drv'. Reason: 3 dependencies failed. Output paths: /nix/store/4apq0fhak6v9vsywhb3371wknbk9jfz9-nixos-system-gk4-26.11.20261027.31ecbac |
||
herculesCI.onPush.default.outputs.hosts.rofl-10
|
2m 11s | |
setup: error: Cannot build '/nix/store/2vc4ziqya86di8li3bbphqdnc176hm7w-unit-polkit.service.drv'. Reason: 1 dependency failed. Output paths: …setup: error: Cannot build '/nix/store/2vc4ziqya86di8li3bbphqdnc176hm7w-unit-polkit.service.drv'. Reason: 1 dependency failed. Output paths: /nix/store/bxmbqmjxqn02wypv4c7izpci2m6a6g09-unit-polkit.service error: Cannot build '/nix/store/6lzkssl697nghncib5m3qjspkhhks6mv-unit-dbus-broker.service.drv'. Reason: 1 dependency failed. Output paths: /nix/store/zxc53n2r87g4a1rf7z9d4bxfpsv232xi-unit-dbus-broker.service error: Cannot build '/nix/store/b2lnva61xl887jdf07jsk8n9qpymkn8k-unit-dbus-broker.service.drv'. Reason: 1 dependency failed. Output paths: /nix/store/0jlny5dfcamqxwmf4w78jrhizrp1g6fq-unit-dbus-broker.service error: Cannot build '/nix/store/hyr0vxl7jcn77drdyyl3j2z2lhfphqn4-system-units.drv'. Reason: 6 dependencies failed. Output paths: /nix/store/7pyn5bnknh013l9l339h575zbkb559gj-system-units error: Cannot build '/nix/store/a1i9i06qvgargd596mplq0qwpjvp5p6x-user-units.drv'. Reason: 1 dependency failed. Output paths: /nix/store/zmld7isp9758xs72sdqfxkdyzbvklwx5-user-units error: Cannot build '/nix/store/yyhq815ip0sifw35snmvyx29q9bkfvip-etc.drv'. Reason: 4 dependencies failed. Output paths: /nix/store/blvgn1lk0zs8if9i7qiqgqn76vdn6fn5-etc error: Cannot build '/nix/store/anb2rpqy2ic1qxfzkxf3ca97hm1vjc6k-activate.drv'. Reason: 2 dependencies failed. Output paths: /nix/store/gvrq62s097dd9bmn2n4v5lm8rjns1166-activate error: Cannot build '/nix/store/m0gm2qadli4dqp1c3v1clvr7f1a4hdcb-nixos-system-rofl-10-26.11.20261027.31ecbac.drv'. Reason: 3 dependencies failed. Output paths: /nix/store/p4cgzqyqrw0nncj1vcpgywyq6crfxr7h-nixos-system-rofl-10-26.11.20261027.31ecbac |
||
112 succeeded
| status | attribute | duration |
|---|---|---|
| loading… | ||