pschmitt/nixos-config build #426 failed ← #425 #427 →
eval warnings
3 kinds
· 3 occurrences
- error ×1
- error Failed to fetch git repository 'https://github.com/…' ×1
- warn could not read HEAD ref from repo at 'https://github.com/…', using 'master' ×1
2 failed
| status | attribute | duration |
|---|---|---|
herculesCI.onPush.default.outputs.hosts.ge2
|
41s | |
setup: error: Cannot build '/nix/store/86vblf9s618scc3w2a2xp5rwc4hw1zrp-home-manager-files.drv'. Reason: 2 dependencies failed. Output paths: …setup: error: Cannot build '/nix/store/86vblf9s618scc3w2a2xp5rwc4hw1zrp-home-manager-files.drv'. Reason: 2 dependencies failed. Output paths: /nix/store/0fz9m26imlsccailpdh40j3zgh77nkp0-home-manager-files error: Cannot build '/nix/store/4vg6dvwa39n4mkziyshqimr5vg66w4xi-hm-putter.json.drv'. Reason: 1 dependency failed. Output paths: /nix/store/mf6cnmgcs5x0pjk1i6argn96d0jp81d8-hm-putter.json error: Cannot build '/nix/store/7y062hfs5q2nyq5zkpk7dm0l3ddcanx0-home-manager-generation.drv'. Reason: 3 dependencies failed. Output paths: /nix/store/w03ddp61mq4nj9d8vs3x2xxx1l6zjkl0-home-manager-generation error: Cannot build '/nix/store/55s7j390in6pfphg0cwq8ds0wvgi7dq2-unit-home-manager-pschmitt.service.drv'. Reason: 1 dependency failed. Output paths: /nix/store/98nkz18ahw56ipwjjh4pr4msanxrf6l5-unit-home-manager-pschmitt.service error: Cannot build '/nix/store/11nhkahy9m29yaicypsgay0m4xfav02f-system-units.drv'. Reason: 2 dependencies failed. Output paths: /nix/store/hviwgq1lv5w2jr1jy1crmdm9b2n6z1af-system-units error: Cannot build '/nix/store/81031fn8blcv1ra93ahlzcsa5rch9f4b-etc.drv'. Reason: 3 dependencies failed. Output paths: /nix/store/kn5dg987yazmm07sx5yslmb56lirq8fp-etc error: Cannot build '/nix/store/laqywa1sgkxg13rc1w2fj76xfv8xpmxk-activate.drv'. Reason: 3 dependencies failed. Output paths: /nix/store/2ys9clm2j6xma3vdq2lyly3ardggawk9-activate error: Cannot build '/nix/store/wb6b5h1z4n2dkzcwi9z3jyk1pq7gkv5h-nixos-system-ge2-26.11.20261027.31ecbac.drv'. Reason: 5 dependencies failed. Output paths: /nix/store/r65lvs3xgpvsbvfh6kmjga433zn5g4bj-nixos-system-ge2-26.11.20261027.31ecbac |
||
herculesCI.onPush.default.outputs.hosts.gk4
|
2m 49s | |
setup: error: Cannot build '/nix/store/7dasvkg688cnm35l6baqhg7d53l5j9hm-home-manager-files.drv'. Reason: 1 dependency failed. Output paths: …setup: error: Cannot build '/nix/store/7dasvkg688cnm35l6baqhg7d53l5j9hm-home-manager-files.drv'. Reason: 1 dependency failed. Output paths: /nix/store/r9i6zp20ym315m4bqjd00864vcins046-home-manager-files error: Cannot build '/nix/store/5szzv5iqa6vanh04b33lrvrjxg0766c8-hm-putter.json.drv'. Reason: 1 dependency failed. Output paths: /nix/store/schhwb3svsyn292jadddfxf5bamxys93-hm-putter.json error: Cannot build '/nix/store/dy7nk1zc77i9pypviwm2lmyl226zw3hs-home-manager-generation.drv'. Reason: 3 dependencies failed. Output paths: /nix/store/1r2wk4h7v6ibarb2ds9aaxmfv9bjn7jn-home-manager-generation error: Cannot build '/nix/store/5zdnzry8z19l5852r02bsgnfrvj422w9-unit-home-manager-pschmitt.service.drv'. Reason: 1 dependency failed. Output paths: /nix/store/m6k46pdy1qxcip9ibfjn57jifaahd14i-unit-home-manager-pschmitt.service error: Cannot build '/nix/store/ywhn32xv8x93wvlg7pq5bawdaz6is3bv-system-units.drv'. Reason: 1 dependency failed. Output paths: /nix/store/1ji8lg9m46gmkx6jvj68md6mj02vlrzd-system-units error: Cannot build '/nix/store/fmvbk8izfzax1r8gzwqavvmq25a0qj9f-etc.drv'. Reason: 2 dependencies failed. Output paths: /nix/store/akl2gpg5g8dxkqpqavl8ihfsc8kw2bk0-etc error: Cannot build '/nix/store/zjrplnvgghd38gnlj107y0anlbgxsphj-activate.drv'. Reason: 1 dependency failed. Output paths: /nix/store/95iz9xjcca8x7lsrxz5zz5bisgirp4y2-activate error: Cannot build '/nix/store/2sfirn8bv744a49izk99xl3brkwh8p39-nixos-system-gk4-26.11.20261027.31ecbac.drv'. Reason: 2 dependencies failed. Output paths: /nix/store/x6rky2sflyz282bnqmlz5dzj4513x4l1-nixos-system-gk4-26.11.20261027.31ecbac |
||
10 cancelled
| status | attribute | duration |
|---|---|---|
| loading… | ||
104 succeeded
| status | attribute | duration |
|---|---|---|
| loading… | ||