nixbot

builds

pschmitt/nixos-config build #434 failed

branch main · commit 3f23dd8b61 · · took 14m 54s · eval 14m 41s

eval warnings 10 kinds · 18 occurrences
  • error cannot build on 'ssh-ng://nix-remote-builder@rofl-16.brkn.lol': error: failed to start SSH connection to 'rofl-16.brkn.lol' ×1
  • error cannot build on 'ssh-ng://nix-remote-builder@rofl-14.brkn.lol': error: failed to start SSH connection to 'rofl-14.brkn.lol' ×1
  • warn unable to download 'https://cache.numtide.com/…': Timeout was reached (28) Resolving timed out after 5000 milliseconds ×6
  • warn file 'nar/1agmbkljqjj651lbvn7lpv4cynsjbczrqh8qbf35kwa65rq196qg.nar?hash=…' does not exist in binary cache 'https://cache.rofl-13.brkn.lol/…' ×2
  • warn file 'nar/178xjbph2n640acyg8d74jpfn37cb3d9ix0ydh0cypwib0jkaldc.nar?hash=…' does not exist in binary cache 'https://cache.rofl-13.brkn.lol/…' ×1
  • warn file 'nar/0n9fjv5cnsqlc12dl9bksxvrg5vzl6hqk66nbzd47sqnfqcbr9wf.nar?hash=…' does not exist in binary cache 'https://cache.rofl-13.brkn.lol/…' ×1
  • warn file 'nar/1qxd6isfdvq81bs36y2ax1ryidcnmq11mrvz1kgr8z545nb764ig.nar?hash=…' does not exist in binary cache 'https://cache.rofl-13.brkn.lol/…' ×1
  • warn file 'nar/0x75v5rfy4i4x7hkimf5xczg3wkbqgywrdx0rw9jw6zhs33ygg13.nar?hash=…' does not exist in binary cache 'https://cache.rofl-13.brkn.lol/…' ×2
  • warn file 'nar/1dnh67p92lr4z786lbvgxn0ia332ydlvmcr8ijs9pnvsspwynw5k.nar?hash=…' does not exist in binary cache 'https://cache.rofl-13.brkn.lol/…' ×1
  • warn file 'nar/1b7mifmg5fydff8c27164nxpkilvqnvfksb8qhcj42asyjgl6m26.nar?hash=…' does not exist in binary cache 'https://cache.rofl-13.brkn.lol/…' ×2

2 failed
failed attributes
status attribute duration
failed herculesCI.onPush.default.outputs.hosts.ge2 4m 38s
setup: error: Cannot build '/nix/store/fh9rvryyvpx2rbgk4dq0g6wnf9hgvinh-unit-polkit.service.drv'. Reason: 1 dependency failed. Output paths: …
setup:
error: Cannot build '/nix/store/fh9rvryyvpx2rbgk4dq0g6wnf9hgvinh-unit-polkit.service.drv'.
       Reason: 1 dependency failed.
       Output paths:
         /nix/store/k7k1spfi3hpw2h72bqjvq4ksa3m1v74w-unit-polkit.service
error: Cannot build '/nix/store/b511q3arajmbsgn07vh2v7andw1snbw5-unit-dbus-broker.service.drv'.
       Reason: 1 dependency failed.
       Output paths:
         /nix/store/bq3a9bgckj6r2wm4fp8hq2pzvdbvrw93-unit-dbus-broker.service
error: Cannot build '/nix/store/yswa5pnmcsvl758idfdj8ihxkmmjvlkk-unit-dbus-broker.service.drv'.
       Reason: 1 dependency failed.
       Output paths:
         /nix/store/a4pkfkn5ia48zmksvp4j5hs5aw41i3m1-unit-dbus-broker.service
error: Cannot build '/nix/store/v79vf68m86z4bzb01gj984kpjny26pzn-user-units.drv'.
       Reason: 1 dependency failed.
       Output paths:
         /nix/store/6bfxc9agk1gy5vimj6paqz0yizrg3yp1-user-units
error: Cannot build '/nix/store/grbkcrbwv8vm1dhb4ylj0cgmirrq1mqq-system-units.drv'.
       Reason: 4 dependencies failed.
       Output paths:
         /nix/store/jjm7cqzyffl0sb6gg1k2vsm6b9iv8gzh-system-units
error: Cannot build '/nix/store/jbikk4qw639yhi2pw2gjgn015a8br770-etc.drv'.
       Reason: 8 dependencies failed.
       Output paths:
         /nix/store/lq8b6spiafjnlj3kqv77p11gsam5h9hb-etc
error: Cannot build '/nix/store/vgcsp1m355ilyrmav73nbl58ma489ydx-activate.drv'.
       Reason: 1 dependency failed.
       Output paths:
         /nix/store/hjzqazajhzhsf8mbvmyrb9x3s7qs5swv-activate
error: Cannot build '/nix/store/7371kyswqdhic2vm6jvh4m9gi1a3wnw1-nixos-system-ge2-26.11.20261027.31ecbac.drv'.
       Reason: 2 dependencies failed.
       Output paths:
         /nix/store/q18nmsg2qjc6xxxx0xd3vchkbklc71vj-nixos-system-ge2-26.11.20261027.31ecbac
failed herculesCI.onPush.default.outputs.hosts.lrz 56s
setup: cannot build on 'ssh-ng://nix-remote-builder@rofl-15.brkn.lol': error: failed to start SSH connection to 'rofl-15.brkn.lol' Failed to find a machine for …
setup:
cannot build on 'ssh-ng://nix-remote-builder@rofl-15.brkn.lol': error: failed to start SSH connection to 'rofl-15.brkn.lol'
Failed to find a machine for remote build!
derivation: 6hvv28lxbczs76x40530sfpw3b9vgww8-home-manager-generation.drv
required (system, features): (x86_64-linux, [])
3 available machines:
(systems, maxjobs, supportedFeatures, mandatoryFeatures)
([aarch64-linux, x86_64-linux], 16, [benchmark, big-parallel, nixos-test], [])
([aarch64-linux, x86_64-linux], 16, [benchmark, big-parallel, nixos-test], [])
([aarch64-linux, x86_64-linux], 16, [benchmark, big-parallel, nixos-test], [])
error: Cannot build '/nix/store/6hvv28lxbczs76x40530sfpw3b9vgww8-home-manager-generation.drv'.
       Reason: local builds are disabled (max-jobs = 0)
       Hint: set 'max-jobs' to a non-zero value to enable local builds, or configure remote builders via 'builders'
error: Cannot build '/nix/store/ap0pj36srx9smjhd6ph7bjyhdcp72xdm-unit-home-manager-pschmitt.service.drv'.
       Reason: 1 dependency failed.
       Output paths:
         /nix/store/fhmxfcnjzya6gj8k9vyrk10yglisnl1r-unit-home-manager-pschmitt.service
error: Cannot build '/nix/store/zxpcmf70vc91pzlc1jsddx99i9kmxkfi-system-units.drv'.
       Reason: 1 dependency failed.
       Output paths:
         /nix/store/sdpqisbxpwwg6r7mx0wajp1lz08kc271-system-units
error: Cannot build '/nix/store/wq5nic9p373gv8ckl8lgilw33m9smrdy-etc.drv'.
       Reason: 1 dependency failed.
       Output paths:
         /nix/store/9v7mfsmhqzi9q8cab3952lpqwqsg2ijn-etc
error: Cannot build '/nix/store/cgym3nl5xf0vrwxdaw72ag1c8yjd2ifc-activate.drv'.
       Reason: 1 dependency failed.
       Output paths:
         /nix/store/25laxvf9kj0k2mhkdfvsk1nm8fg2yyl1-activate
error: Cannot build '/nix/store/5acszbjx7syagh6w979944gr5xfsqxlb-nixos-system-lrz-26.11.20261027.31ecbac.drv'.
       Reason: 2 dependencies failed.
       Output paths:
         /nix/store/d33waid8ggp4qyyj7wx3r4mp0k49037p-nixos-system-lrz-26.11.20261027.31ecbac
5 cancelled
cancelled attributes
status attribute duration
loading…
109 succeeded
succeeded attributes
status attribute duration
loading…
effecttrigger when
Done
succeeded failed event build_finished · 7s