nixbot

builds

failed lumine-capture-0.3.0 herculesCI.onPush.default.outputs.hosts.ge2 · build #175 · raw

unpackPhase
1unpacking source archive /nix/store/a0p0gjj56hl81j5rlj92g4n99m4kckbj-source2source root is source3Executing cargoSetupPostUnpackHook4Finished cargoSetupPostUnpackHook
patchPhase
5Executing cargoSetupPostPatchHook6Validating consistency between /build/source/Cargo.lock and /build/cargo-vendor-dir/Cargo.lock7Finished cargoSetupPostPatchHook
buildPhase
8Executing cargoBuildHook9cargoBuildHook flags: -j 32 --target x86_64-unknown-linux-gnu --offline --profile release10 Compiling proc-macro2 v1.0.10711 Compiling quote v1.0.4712 Compiling unicode-ident v1.0.2613 Compiling pkg-config v0.3.3414 Compiling libc v0.2.18915 Compiling shlex v2.0.116 Compiling find-msvc-tools v0.1.1317 Compiling cfg-if v1.0.518 Compiling autocfg v1.5.119 Compiling bitflags v2.13.220 Compiling libm v0.2.1621 Compiling smallvec v1.16.122 Compiling memchr v2.8.323 Compiling log v0.4.3424 Compiling crossbeam-utils v0.8.2325 Compiling pin-project-lite v0.2.1726 Compiling winnow v1.0.427 Compiling serde_core v1.0.22928 Compiling toml_datetime v1.1.1+spec-1.1.029 Compiling vcpkg v0.2.1530 Compiling once_cell v1.21.431 Compiling rustix v1.1.532 Compiling version_check v0.9.533 Compiling linux-raw-sys v0.12.134 Compiling serde v1.0.22935 Compiling crossbeam-epoch v0.9.2136 Compiling glob v0.3.437 Compiling target-lexicon v0.13.538 Compiling simd-adler32 v0.3.1039 Compiling futures-core v0.3.3440 Compiling arrayvec v0.7.841 Compiling crossbeam-deque v0.8.842 Compiling zerocopy v0.8.5743 Compiling cc v1.4.744 Compiling httparse v1.10.145 Compiling thiserror v2.0.2046 Compiling openssl v0.10.8147 Compiling rayon-core v1.13.048 Compiling clang-sys v1.9.149 Compiling heck v0.5.050 Compiling strsim v0.11.151 Compiling num-traits v0.2.1952 Compiling minimal-lexical v0.2.153 Compiling either v1.18.054 Compiling parking v2.2.155 Compiling serde_spanned v1.1.156 Compiling ident_case v1.0.157 Compiling adler2 v2.0.158 Compiling regex-syntax v0.8.1159 Compiling nom v8.0.060 Compiling libloading v0.8.961 Compiling futures-io v0.3.3462 Compiling slab v0.4.1263 Compiling wayland-sys v0.31.1164 Compiling nom v7.1.365 Compiling version-compare v0.2.166 Compiling unicode-width v0.2.267 Compiling native-tls v0.2.1868 Compiling anyhow v1.0.10469 Compiling crc32fast v1.5.270 Compiling anstyle v1.0.1471 Compiling bindgen v0.72.172 Compiling hashbrown v0.17.173 Compiling shlex v1.3.074 Compiling downcast-rs v1.2.175 Compiling equivalent v1.0.276 Compiling rustc-hash v2.1.377 Compiling itertools v0.13.078 Compiling paste v1.0.1579 Compiling miniz_oxide v0.9.180 Compiling quick-xml v0.41.081 Compiling foreign-types-shared v0.1.182 Compiling wayland-client v0.31.1583 Compiling zeroize v1.9.084 Compiling cfg-expr v0.20.985 Compiling annotate-snippets v0.11.586 Compiling foreign-types v0.3.287 Compiling tracing-core v0.1.3688 Compiling unicode-segmentation v1.13.389 Compiling fastrand v2.5.090 Compiling base64ct v1.8.391 Compiling itoa v1.0.1892 Compiling cfg_aliases v0.2.293 Compiling toml_parser v1.1.3+spec-1.1.094 Compiling bytes v1.12.195 Compiling syn v3.0.696 Compiling syn v2.0.11997 Compiling fnv v1.0.798 Compiling getrandom v0.3.499 Compiling stable_deref_trait v1.2.1100 Compiling pem-rfc7468 v1.0.0101 Compiling as-slice v0.2.1102 Compiling rustls-pki-types v1.15.1103 Compiling concurrent-queue v2.5.0104 Compiling miniz_oxide v0.8.9105 Compiling flate2 v1.1.10106 Compiling core_maths v0.1.1107 Compiling itertools v0.14.0108 Compiling event-listener v5.4.2109 Compiling matrixmultiply v0.3.11110 Compiling indexmap v2.14.2111 Compiling getrandom v0.4.3112 Compiling openssl-sys v0.9.117113 Compiling wayland-backend v0.3.17114 Compiling http v1.5.0115 Compiling toml v1.1.6+spec-1.1.0116 Compiling built v0.8.1117 Compiling target-features v0.1.6118 Compiling rand_core v0.10.1119 Compiling rayon v1.12.0120 Compiling quick-error v2.0.1121 Compiling openssl-probe v0.2.1122 Compiling av-scenechange v0.14.1123 Compiling base64 v0.23.1124 Compiling byteorder v1.5.0125 Compiling event-listener-strategy v0.5.4126 Compiling system-deps v7.0.8127 Compiling webpki-root-certs v1.0.9128 Compiling ttf-parser v0.25.1129 Compiling der v0.8.2130 Compiling aligned v0.4.3131 Compiling socks v0.3.4132 Compiling futures-lite v2.6.1133 Compiling wayland-scanner v0.31.11134 Compiling no_std_io2 v0.9.4135 Compiling pulp v0.22.3136 Compiling num-integer v0.1.47137 Compiling slotmap v1.1.1138 Compiling regex-automata v0.4.18139 Compiling rav1e v0.8.1140 Compiling fdeflate v0.3.7141 Compiling utf8-zero v0.8.1142 Compiling toml_edit v0.25.15+spec-1.1.0143 Compiling rustversion v1.0.23144 Compiling cexpr v0.6.0145 Compiling num-bigint v0.4.8146 Compiling zune-core v0.5.3147 Compiling y4m v0.8.0148 Compiling percent-encoding v2.3.2149 Compiling pastey v0.1.1150 Compiling ureq-proto v0.6.4151 Compiling rawpointer v0.2.1152 Compiling memmap2 v0.9.11153 Compiling weezl v0.1.12154 Compiling zune-jpeg v0.5.15155 Compiling errno v0.3.14156 Compiling png v0.18.1157 Compiling bitstream-io v4.10.0158 Compiling onig_sys v69.9.3159 Compiling simd_helpers v0.1.0160 Compiling async-io v2.6.0161 Compiling raw-cpuid v11.6.0162 Compiling imgref v1.12.3163 Compiling strength_reduce v0.2.4164 Compiling zmij v1.0.23165 Compiling lzma-rust2 v0.15.8166 Compiling proc-macro-crate v3.5.0167 Compiling new_debug_unreachable v1.0.6168 Compiling color_quant v1.1.0169 Compiling parking_lot_core v0.9.12170 Compiling byteorder-lite v0.1.0171 Compiling portable-atomic v1.15.0172 Compiling reborrow v0.5.5173 Compiling hmac-sha256 v1.1.14174 Compiling roxmltree v0.20.0175 Compiling noop_proc_macro v0.3.0176 Compiling pulp-wasm-simd-flag v0.1.1177 Compiling cpufeatures v0.3.1178 Compiling chacha20 v0.10.2179 Compiling gif v0.14.2180 Compiling loop9 v0.1.5181 Compiling regex v1.13.1182 Compiling maybe-rayon v0.1.1183 Compiling image-webp v0.2.4184 Compiling num-rational v0.4.2185 Compiling transpose v0.2.3186 Compiling signal-hook-registry v1.4.8187 Compiling rand_core v0.9.5188 Compiling primal-check v0.3.4189 Compiling fontconfig-parser v0.5.8190 Compiling approx v0.5.1191 Compiling nix v0.30.1192 Compiling aho-corasick v1.1.5193 Compiling ahash v0.8.12194 Compiling avif-serialize v0.8.9195 Compiling zune-inflate v0.2.54196 Compiling float-cmp v0.9.0197 Compiling bit_field v0.10.3198 Compiling endi v1.1.1199 Compiling serde_json v1.0.151200 Compiling async-task v4.7.1201 Compiling futures-sink v0.3.34202 Compiling pxfm v0.1.30203 Compiling esaxx-rs v0.1.10204 Compiling fax v0.2.7205 Compiling scopeguard v1.2.0206 Compiling lebe v0.5.3207 Compiling tinyvec v1.13.3208 Compiling lock_api v0.4.14209 Compiling console v0.16.6210 Compiling futures-channel v0.3.34211 Compiling strict-num v0.1.1212 Compiling castaway v0.2.4213 Compiling rand v0.10.2214 Compiling darling_core v0.20.11215 Compiling libspa v0.9.2216 Compiling num-iter v0.1.46217 Compiling owned_ttf_parser v0.25.1218 Compiling async-channel v2.5.0219 Compiling polycool v0.4.0220 Compiling ab_glyph_rasterizer v0.1.10221 Compiling futures-task v0.3.34222 Compiling atomic-waker v1.1.2223 Compiling arrayref v0.3.9224 Compiling typenum v1.20.1225 Compiling pastey v0.2.3226 Compiling unit-prefix v0.5.2227 Compiling foldhash v0.1.5228 Compiling macro_rules_attribute-proc_macro v0.2.3229 Compiling ryu v1.0.23230 Compiling base64 v0.13.1231 Compiling static_assertions v1.1.0232 Compiling polling v3.11.0233 Compiling hashbrown v0.15.5234 Compiling rand_distr v0.6.0235 Compiling indicatif v0.18.6236 Compiling piper v0.2.5237 Compiling macro_rules_attribute v0.2.3238 Compiling kurbo v0.13.1239 Compiling ab_glyph v0.2.32240 Compiling parking_lot v0.12.5241 Compiling async-signal v0.2.14242 Compiling darling_core v0.24.1243 Compiling rayon-cond v0.4.0244 Compiling mio v1.2.3245 Compiling zerocopy-derive v0.8.57246 Compiling openssl-macros v0.1.1247 Compiling equator-macro v0.4.2248 Compiling tracing-attributes v0.1.31249 Compiling enumflags2_derive v0.7.12250 Compiling arg_enum_proc_macro v0.3.4251 Compiling profiling-procmacros v1.0.18252 Compiling num-derive v0.4.2253 Compiling nalgebra-macros v0.3.0254 Compiling monostate-impl v0.1.18255 Compiling multiversion-macros v0.8.0256 Compiling socket2 v0.6.5257 Compiling darling_macro v0.20.11258 Compiling async-lock v3.4.2259 Compiling profiling v1.0.18260 Compiling convert_case v0.8.0261 Compiling equator v0.4.2262 Compiling moxcms v0.8.1263 Compiling monostate v0.1.18264 Compiling memoffset v0.9.1265 Compiling unicode-normalization-alignments v0.1.12266 Compiling aligned-vec v0.6.4267 Compiling unicode-script v0.5.8268 Compiling daachorse v3.0.3269 Compiling darling v0.20.11270 Compiling derive_builder_core v0.20.2271 Compiling wayland-protocols v0.32.13272 Compiling v_frame v0.3.9273 Compiling siphasher v1.0.3274 Compiling bytemuck_derive v1.12.1275 Compiling serde_derive v1.0.229276 Compiling thiserror-impl v2.0.20277 Compiling tracing v0.1.44278 Compiling av1-grain v0.2.5279 Compiling futures-macro v0.3.34280 Compiling tokio-macros v2.7.2281 Compiling fixedbitset v0.5.7282 Compiling unicode_categories v0.1.1283 Compiling cookie-factory v0.3.3284 Compiling unicode-bidi v0.3.18285 Compiling multiversion v0.8.0286 Compiling petgraph v0.8.3287 Compiling calloop v0.14.4288 Compiling svgtypes v0.16.1289 Compiling async-trait v0.1.92290 Compiling serde_repr v0.1.21291 Compiling derive_builder_macro v0.20.2292 Compiling futures-util v0.3.34293 Compiling async-process v2.5.0294 Compiling tokio v1.53.1295 Compiling bytemuck v1.25.2296 Compiling async-recursion v1.1.1297 Compiling darling_macro v0.24.1298 Compiling blocking v1.7.0299 Compiling num-complex v0.4.6300 Compiling font-types v0.12.5301 Compiling safe_arch v1.2.0302 Compiling rgb v0.8.53303 Compiling font-types v0.11.3304 Compiling rustfft v6.4.1305 Compiling qoi v0.4.1306 Compiling read-fonts v0.41.0307 Compiling wide v1.7.1308 Compiling darling v0.24.1309 Compiling num v0.4.3310 Compiling ndarray v0.17.2311 Compiling derive_builder v0.20.2312 Compiling read-fonts v0.37.0313 Compiling tiny-skia-path v0.12.0314 Compiling ureq v3.4.2315 Compiling oar-ocr-derive v0.9.2316 Compiling xkeysym v0.2.1317 Compiling fontdb v0.24.0318 Compiling async-executor v1.14.0319 Compiling uuid v1.26.1320 Compiling clipper2-rust v1.2.0321 Compiling async-broadcast v0.7.2322 Compiling libspa-sys v0.9.2323 Compiling pipewire-sys v0.9.2324 Compiling nix v0.31.3325 Compiling smithay-client-toolkit v0.21.1326 Compiling itertools v0.15.0327 Compiling roxmltree v0.21.1328 Compiling simplecss v0.2.2329 Compiling ordered-stream v0.2.0330 Compiling onig v6.5.3331 Compiling zvariant_utils v4.2.0332 Compiling enumflags2 v0.7.12333 Compiling zcheapstr v1.1.0334 Compiling ort-sys v2.0.0-rc.13335 Compiling cursor-icon v1.2.0336 Compiling xcursor v0.3.11337 Compiling compact_str v0.9.1338 Compiling dary_heap v0.3.9339 Compiling spm_precompiled v0.1.4340 Compiling yazi v0.2.1341 Compiling data-url v0.3.2342 Compiling zvariant_derive v5.15.0343 Compiling pico-args v0.5.0344 Compiling imagesize v0.15.0345 Compiling option-ext v0.2.0346 Compiling zeno v0.3.3347 Compiling xmlwriter v0.1.0348 Compiling hex v0.4.3349 Compiling unicode-vo v0.1.0350 Compiling dirs-sys v0.5.0351 Compiling futures-executor v0.3.34352 Compiling wayland-cursor v0.31.14353 Compiling wayland-csd-frame v0.3.0354 Compiling zvariant v5.15.0355 Compiling xkbcommon v0.8.0356 Compiling tiny-skia v0.12.0357 Compiling tree_magic_mini v3.2.2358 Compiling calloop-wayland-source v0.4.1359 Compiling strum_macros v0.28.0360 Compiling fontdb v0.23.0361 Compiling half v2.7.1362 Compiling ppv-lite86 v0.2.21363 Compiling os_pipe v1.2.3364 Compiling linebender_resource_handle v0.1.1365 Compiling smol_str v0.3.2366 Compiling self_cell v1.3.0367 Compiling iana-time-zone v0.1.65368 Compiling sys-locale v0.3.2369 Compiling rand_chacha v0.9.0370 Compiling ravif v0.13.0371 Compiling exr v1.74.2372 Compiling tiff v0.11.3373 Compiling rand v0.9.5374 Compiling lumine-capture v0.3.0 (/build/source)375 Compiling rustdct v0.7.1376 Compiling wayland-protocols-wlr v0.3.12377 Compiling wayland-protocols-experimental v20251230.0.3378 Compiling wayland-protocols-misc v0.3.12379 Compiling unicode-linebreak v0.1.5380 Compiling tokenizers v0.23.2381 Compiling zbus_names v4.3.4382 Compiling rangemap v1.8.0383 Compiling toml_writer v1.1.2+spec-1.1.0384 Compiling wl-clipboard-rs v0.9.4385 Compiling strum v0.28.0386 Compiling ort v2.0.0-rc.13387 Compiling chrono v0.4.45388 Compiling futures v0.3.34389 Compiling dirs v7.0.0390 Compiling zbus_macros v5.19.0391 Compiling simba v0.10.2392 Compiling image v0.25.10393 Compiling skrifa v0.40.0394 Compiling harfrust v0.5.2395 Compiling skrifa v0.44.0396 Compiling harfrust v0.12.0397 Compiling zbus v5.19.0398 Compiling pipewire v0.9.2399 Compiling nalgebra v0.35.0400 Compiling swash v0.2.10401 Compiling usvg v0.48.1402 Compiling resvg v0.48.1403 Compiling cosmic-text v0.19.0404 Compiling ashpd v0.13.13405 Compiling imageproc v0.27.0406 Compiling oar-ocr-core v0.9.2407 Compiling oar-ocr v0.9.2408 Finished `release` profile [optimized] target(s) in 1m 45s409Executing cargoInstallPostBuildHook410Finished cargoInstallPostBuildHook411Finished cargoBuildHook412buildPhase completed in 1 minutes 45 seconds
checkPhase
413Executing cargoCheckHook414cargoCheckHook flags: -j 32 --profile release --target x86_64-unknown-linux-gnu --offline --415 Compiling lumine-capture v0.3.0 (/build/source)416 Finished `release` profile [optimized] target(s) in 22.89s417 Running unittests src/main.rs (target/x86_64-unknown-linux-gnu/release/deps/lumine_capture-b53f26365e0f0f21)418419running 129 tests420test app::init::tests::the_scale_comes_from_the_logical_size ... ok421test app::init::tests::broken_frames_are_reported_not_panicking ... ok422test backend::wayland::capture::kde::tests::argb32_formats_are_swapped ... ok423test app::init::tests::frames_from_every_backend_become_the_same_pixmap ... ok424test backend::wayland::capture::kde::tests::missing_format_means_argb32 ... ok425test backend::wayland::capture::kde::tests::kwin_6_7_bytes_become_rgba ... ok426test backend::wayland::capture::kde::tests::other_formats_are_rejected ... ok427test backend::wayland::capture::kde::tests::rgba8888_formats_keep_their_order ... ok428test backend::notify::temp::tests::prune_removes_the_oldest_over_budget ... ok429test backend::wayland::capture::shm_copy::tests::padded_and_inverted_rows_come_back_tight_and_upright ... ok430test backend::wayland::capture::kde::tests::rgbx_bytes_become_opaque_rgba ... ok431test backend::wayland::capture::shm_copy::tests::rotated_frames_come_back_upright ... ok432test backend::wayland::capture::shm_copy::tests::the_best_shm_format_wins_over_the_advertised_order ... ok433test config::tests::magnifier_size_matches_cells_times_zoom ... ok434test config::tests::a_flipped_range_falls_back_to_the_default ... ok435test config::tests::a_bad_line_is_skipped_and_the_rest_applies ... ok436test config::tests::empty_file_gives_defaults ... ok437test config::tests::even_magnifier_cells_fall_back_to_the_default ... ok438test config::tests::colors_parse_with_and_without_alpha ... ok439test config::tests::keys_take_a_string_or_a_list ... ok440test config::tests::old_accept_and_save_always_become_to ... ok441test config::tests::partial_file_keeps_the_rest_default ... ok442test config::tests::overlay_is_window_layer_or_auto ... ok443test config::tests::unknown_keys_are_ignored ... ok444test config::tests::the_template_mentions_every_option ... ok445test fonts::tests::system_fonts_never_replace_the_bundled_inter ... ok446test config::tests::unset_colors_follow_the_theme ... ok447test fonts::tests::every_ui_style_is_bundled ... ok448test config::tests::too_slow_animation_speed_falls_back_to_the_default ... ok449test keys::tests::empty_binding_disables_the_action ... ok450test config::tests::to_takes_letters_and_can_be_turned_off ... ok451test keys::tests::override_replaces_the_defaults ... ok452test ocr::daemon::protocol::tests::bad_state_and_status_flags ... ok453test ocr::daemon::protocol::tests::empty_frame_and_unknown_tags ... ok454test keys::tests::defaults_parse_and_never_collide ... ok455test keys::tests::modifiers_parse_in_any_order_and_case ... ok456test ocr::daemon::protocol::tests::mismatched_image_is_not_sent ... ok457test keys::tests::a_bad_binding_keeps_only_its_own_default ... ok458test keys::tests::named_and_punctuation_keys_parse ... ok459test ocr::daemon::protocol::tests::replies_roundtrip ... ok460test ocr::daemon::protocol::tests::several_frames_read_back_in_order ... ok461test keys::tests::a_duplicate_chord_keeps_the_first_action ... ok462test ocr::daemon::protocol::tests::trailing_bytes_are_rejected ... ok463test ocr::daemon::protocol::tests::truncated_frames_are_errors_not_panics ... ok464test ocr::daemon::protocol::tests::welcome_from_another_version_is_still_readable ... ok465test ocr::daemon::tests::a_daemon_that_died_on_the_gpu_is_not_followed_onto_it ... ok466test ocr::daemon::tests::a_damaged_measurement_is_ignored ... ok467test ocr::daemon::tests::auto_lands_on_the_device_this_machine_measured ... ignored468test ocr::daemon::tests::a_measurement_from_other_hardware_is_ignored ... ok469test ocr::daemon::tests::a_measurement_survives_a_save_and_a_reload ... ok470test ocr::daemon::protocol::tests::lines_are_validated ... ok471test ocr::daemon::protocol::tests::bad_image_sizes ... ok472test ocr::daemon::protocol::tests::non_utf8_paths_survive ... ok473test ocr::daemon::protocol::tests::oversized_frames_are_refused_before_allocating ... ok474test ocr::daemon::protocol::tests::requests_roundtrip ... ok475test ocr::daemon::protocol::tests::hello_from_a_newer_client_may_carry_more ... ok476test ocr::daemon::tests::child_daemon ... ignored, entry point of the daemon processes started by the tests below477test keys::tests::bad_chords_are_rejected ... ok478test ocr::daemon::tests::an_engine_that_could_not_be_measured_is_kept_as_failed ... ok479test ocr::daemon::tests::a_summary_names_the_winner_and_the_numbers ... ok480test config::tests::the_template_reads_back_as_the_defaults ... ok481test ocr::daemon::tests::daemon_dying_mid_scan_means_a_local_read_and_a_strike ... ok482test ocr::daemon::tests::local_engine_cost ... ignored483test ocr::daemon::tests::socket_left_by_a_dead_daemon_is_replaced ... FAILED484test ocr::daemon::tests::garbage_and_requests_before_hello_close_only_that_connection ... ok485test ocr::daemon::tests::repeated_failures_stop_spawning_for_a_while ... ok486test ocr::daemon::tests::strike_rules ... ok487test ocr::daemon::tests::a_successful_scan_clears_old_strikes ... ok488test ocr::daemon::tests::daemon_does_not_inherit_descriptors ... ok489test ocr::daemon::tests::the_gpu_engine_is_seen_by_the_check_above ... ignored490test ocr::daemon::tests::the_local_engine_never_touches_the_gpu ... ignored491test ocr::daemon::tests::the_gpu_has_to_win_by_a_margin ... ok492test ocr::daemon::tests::the_machine_key_does_not_drift ... ok493test ocr::daemon::tests::scan_before_the_engine_is_ready_is_refused_quickly ... ok494test ocr::daemon::tests::daemon_from_another_build_is_replaced_exactly_once ... ok495test ocr::daemon::tests::status_and_stop_commands ... ok496test ocr::daemon::tests::too_long_socket_path_is_an_error_not_a_panic ... ok497test ocr::paddle_backend::tests::outer_boundaries_sit_on_the_box_edges ... ok498test ocr::runtime::tests::nothing_loaded_is_unavailable ... ok499test ocr::daemon::tests::the_probe_image_is_the_same_every_time ... ok500test ocr::daemon::protocol::tests::too_many_lines_are_not_sent ... ok501test ocr::daemon::tests::handshake_with_a_leaving_daemon_is_retried_without_a_strike ... ok502test ocr::runtime::tests::on_demand_scan_builds_the_engine_itself ... ok503test ocr::runtime::tests::new_model_clears_a_failure ... ok504test ocr::runtime::tests::panicking_scan_does_not_leave_an_endless_spinner ... ok505test ocr::settings::tests::daemon_needs_a_gpu_unless_cpu_is_forced ... ok506test ocr::settings::tests::local_modes_are_kept ... ok507test ocr::settings::tests::nothing_runs_in_the_background_by_default ... ok508test renderer::blur::tests::piece_matches_whole ... ok509test tests::region_rejects_any_other_word ... ok510test tests::region_takes_an_optional_ocr ... ok511test types::events::tests::empty_outputs_do_nothing ... ok512test types::events::tests::outputs_ignore_order_and_repeats ... ok513test types::events::tests::unknown_letter_is_rejected ... ok514test ui::icons::tests::every_icon_parses ... ok515test utils::tests::png_with_alpha_stores_straight_colors ... ok516test utils::tests::saving_twice_with_the_same_name_keeps_both_files ... ok517test utils::tests::written_file_gets_the_given_mode ... ok518test ocr::daemon::tests::shutdown_does_not_wait_for_a_long_scan ... ok519test ocr::runtime::tests::failed_build_reports_once_then_fails_fast ... ok520test ocr::runtime::tests::cancel_interrupts_the_scan_and_keeps_the_engine ... ok521test ocr::runtime::tests::on_demand_builds_nothing_until_asked ... ok522test ocr::daemon::tests::cancelling_while_the_daemon_scans_returns_at_once ... ok523test ocr::runtime::tests::second_scan_while_busy_is_refused ... ok524test ocr::daemon::tests::daemon_that_dies_while_loading_is_not_respawned_forever ... ok525test ocr::runtime::tests::scan_before_the_engine_is_ready_is_parked ... ok526test ocr::daemon::tests::second_daemon_leaves_the_first_one_serving ... ok527test ocr::runtime::tests::prepare_does_not_rebuild_an_engine_that_is_scanning ... ok528test ocr::runtime::tests::switching_models_mid_scan_retires_the_old_engine ... ok529test ocr::daemon::tests::real_daemon_processes_do_not_stack ... ok530test ocr::daemon::tests::daemon_without_gpu_is_remembered_and_not_started_again ... ok531test ocr::daemon::tests::panicking_loader_is_reported_as_failed ... ok532test ocr::daemon::tests::idle_daemon_leaves_and_cleans_up ... ok533test ocr::daemon::tests::concurrent_clients_start_a_single_daemon ... ok534test ocr::daemon::tests::hung_daemon_is_killed_and_the_scan_read_locally ... ok535test ocr::daemon::tests::client_starts_the_daemon_and_moves_to_it_when_warm ... ok536test ocr::daemon::tests::silent_client_is_dropped_without_blocking_others ... ok537test ocr::daemon::tests::crashing_engine_is_dropped_and_the_daemon_leaves ... ok538test ocr::daemon::tests::switching_models_during_a_scan_keeps_the_answer ... ok539test ocr::runtime::tests::scan_started_while_a_cancelled_one_drains_runs_after_it ... ok540test ocr::daemon::tests::client_that_leaves_cancels_its_scan ... ok541test ocr::daemon::tests::engine_that_cannot_run_makes_the_daemon_leave ... ok542test ocr::daemon::tests::hung_real_daemon_is_killed_by_the_watchdog ... ok543test ocr::daemon::tests::only_the_latest_requested_model_is_kept ... ok544test ocr::daemon::tests::idle_exit_waits_for_an_open_connection ... ok545test ocr::daemon::tests::hello_and_status_answer_while_loading_and_scanning ... ok546test ocr::daemon::tests::idle_timer_does_not_fire_during_a_scan ... ok547test ocr::daemon::tests::killed_daemon_is_survived_and_replaced ... ok548test ocr::daemon::tests::stop_kills_a_frozen_daemon ... ok549550failures:551552---- ocr::daemon::tests::socket_left_by_a_dead_daemon_is_replaced stdout ----553554thread 'ocr::daemon::tests::socket_left_by_a_dead_daemon_is_replaced' (10183) panicked at src/ocr/daemon/tests.rs:302:5:555assertion failed: UnixStream::connect(&paths.socket).is_err()556note: run with `RUST_BACKTRACE=1` environment variable to display a backtrace557558559failures:560 ocr::daemon::tests::socket_left_by_a_dead_daemon_is_replaced561562test result: FAILED. 123 passed; 1 failed; 5 ignored; 0 measured; 0 filtered out; finished in 2.59s563564error: test failed, to rerun pass `--bin lumine-capture`